hey, with the C++ cryptor, i compiled and used XOR.exe and moved the strings.h file to /stub
that got rid of a lot of errors, but now i am getting one more that i cannot figure out...
------ Build started: Project: Stub, Configuration: Debug Win32 ------
Linking...
main.obj : error LNK2019: unresolved external symbol_imp__InitCommonControls@0 referenced in function "int __stdcall DlgProc(struct HWND_ *,unsigned int,unsigned int,long)" (?DlgProc@@YGHPAUHWND__@@IIJ@Z)
..\Debug/Stub.exe : fatal error LNK1120: 1 unresolved externals
Build log was saved at "file://c:\Documents and Settings\*****\Desktop\cryptor source\Debug\BuildLog.htm"
Stub - 2 error(s), 0 warning(s)
------ Build started: Project: darkcrypt0r, Configuration: Debug Win32 ------
Compiling resources...
Microsoft ® Windows ® Resource Compiler Version 6.1.6723.1
Copyright © Microsoft Corporation. All rights reserved.
.\darkcrypt0r.rc(132) : error RC2135 : file not found: ..\Release\Stub.exe
Build log was saved at "file://c:\Documents and Settings\*****\Desktop\cryptor source\Debug\BuildLog.htm"
darkcrypt0r - 1 error(s), 0 warning(s)
========== Build: 0 succeeded, 2 failed, 0 up-to-date, 0 skipped ==========
that got rid of a lot of errors, but now i am getting one more that i cannot figure out...
------ Build started: Project: Stub, Configuration: Debug Win32 ------
Linking...
main.obj : error LNK2019: unresolved external symbol_imp__InitCommonControls@0 referenced in function "int __stdcall DlgProc(struct HWND_ *,unsigned int,unsigned int,long)" (?DlgProc@@YGHPAUHWND__@@IIJ@Z)
..\Debug/Stub.exe : fatal error LNK1120: 1 unresolved externals
Build log was saved at "file://c:\Documents and Settings\*****\Desktop\cryptor source\Debug\BuildLog.htm"
Stub - 2 error(s), 0 warning(s)
------ Build started: Project: darkcrypt0r, Configuration: Debug Win32 ------
Compiling resources...
Microsoft ® Windows ® Resource Compiler Version 6.1.6723.1
Copyright © Microsoft Corporation. All rights reserved.
.\darkcrypt0r.rc(132) : error RC2135 : file not found: ..\Release\Stub.exe
Build log was saved at "file://c:\Documents and Settings\*****\Desktop\cryptor source\Debug\BuildLog.htm"
darkcrypt0r - 1 error(s), 0 warning(s)
========== Build: 0 succeeded, 2 failed, 0 up-to-date, 0 skipped ==========


![[Image: dVTDnDY.gif]](https://i.imgur.com/dVTDnDY.gif)

